{"text_format":"1","workbook":"xlsx","n_sheets":9,"sheets":["Cover Sheet","QNST01","QNST02","QNST03","QNST04","QNST05_A","QNST05_B","CBM","List"],"not_rendered":{"charts":0,"images":34,"macros":1,"external_links":1,"defined_names":4,"comments":1,"pivot_tables":0},"unopened":[],"bounds":{"document_bytes":16777216,"sheet_cells":100000,"rows_first":2000,"rows_last":500,"rows_between":2000,"halvings":0,"cell_chars":16384,"cell_head_chars":4096},"cells_cut":0,"cells_raw":0,"read":"row_number_cap","date_system":"1900"}

{"sheet":"Cover Sheet","index":0,"n_rows":41,"n_cols":4,"rows_kept":41,"cut":false,"hidden":false,"merged":[[4,1,4,2],[5,0,5,4],[6,0,6,4],[9,1,10,2]]}
[]
[]
[]
[]
[]
["MFSA"]
["MALTA FINANCIAL SERVICES AUTHORITY"]
[]
[]
[null,"Quarterly National Specific Templates"]
[]
[]
[]
["1(a)","Name of Licence Holder"]
[]
["1(b)","Code"]
[]
[2,"Type of business carried out",null,""]
[]
[]
[3,"For the period from:"]
[null,"to:"]
[]
[4,"Currency in which accounts are reported","EUR"]
[null,"Exchange Rate to Euro at period end ",null,{"$f":"IF(C25=\"\",0,1)","v":0}]
[]
[]
[null,"Version 06/2023"]
[]
[]
[]
[]
[]
[]
[null,null,"Long Term Business"]
[null,null,"General Business"]
[null,null,"Pure Reinsurance Business"]
[null,"EUR","Composite"]
[null,"GBP"]
[null,"USD"]
{"$rows_left_out":2}
{"sheet":"QNST01","index":1,"n_rows":35,"n_cols":6,"rows_kept":35,"cut":false,"hidden":false,"merged":[[12,1,12,3],[0,2,0,4],[1,2,1,4],[3,2,3,4],[4,2,4,4],[6,0,6,4],[13,0,13,4],[14,1,14,3],[18,1,18,3],[29,1,29,3],[19,1,19,3],[15,1,15,3],[16,1,16,3],[17,1,17,3],[21,1,21,3],[30,0,30,4],[31,1,31,3],[32,0,32,4],[34,1,34,4],[22,0,22,4],[23,1,23,3],[24,1,24,3],[28,1,28,3]]}
["Name of licenceholder:",null,{"$f":"'Cover Sheet'!C14","v":0}]
["Type of business carried out:",null,"General Business"]
["Period from:",null,{"$f":"'Cover Sheet'!C21","v":"00:00:00"},"to",{"$f":"'Cover Sheet'!C22","v":"00:00:00"}]
["Document type:",null,"MFSA National Specific Templates"]
["Sheet Code:",null,"QNST01"]
[]
["Technical Account - General Business"]
[]
[null,null,null,null,"Amount"]
[null,"Currency",null,null,"EUR"]
[1.1000000000000001,"Contracts measured under the Premium Allocation Approach",null,null,0]
[1.1100000000000001,"Contracts not measured under the Premium Allocation Approach",null,null,0]
[1,"Insurance revenue",null,null,{"$f":"SUM(E11:E12)","v":0},"calc."]
[]
[2.1,"Incurred claims and insurance services expenses",null,null,0]
[2.11,"Amortisation of insurance acquisition cash flows",null,null,0]
[2.12,"Losses and reversals of losses on onerous contracts",null,null,0]
[2.13,"Adjustments to liabilities for incurred claims",null,null,0]
[2.14,"(Impairment losses) and reversals of Insurance Acquisition Cash flows assets",null,null,0]
[2,"Insurance service expenses",null,null,{"$f":"SUM(E15:E19)","v":0},"calc."]
[]
[3,"Insurance service result before reinsurance contracts held",null,null,{"$f":"E13-E20","v":0},"calc."]
[]
[4.0999999999999996,"Allocation of reinsurance premiums paid",null,null,0]
[4.1100000000000003,"Amounts recoverable from reinsurers",null,null,0]
[4.12,"        Recoveries of incurred claims and other insurance service expenses",null,null,0]
[4.13,"        Recoveries and reversals of recoveries of losses on onerous underlying contracts",null,null,0]
[4.1399999999999997,"        Adjustments to assets for incurred claims"]
[4.1500000000000004,"Effect of changes in non-performance risk of reinsurers",null,null,0]
[4,"Net expenses from reinsurance contracts",null,null,{"$f":"SUM(E24:E29)","v":0},"calc."]
[]
[5,"Insurance Service Result - General Business",null,null,{"$f":"E22-E30","v":0},"calc."]
[]
[null,"Notes"]
["i","Please key in a value for each cell in the table where there is a validation. Where the cell contains no value, a value of zero is to be keyed in."]

{"sheet":"QNST02","index":2,"n_rows":35,"n_cols":6,"rows_kept":35,"cut":false,"hidden":false,"merged":[[31,1,31,3],[12,1,12,3],[0,2,0,4],[1,2,1,4],[3,2,3,4],[4,2,4,4],[6,0,6,4],[32,0,32,4],[34,1,34,4],[13,0,13,4],[14,1,14,3],[15,1,15,3],[16,1,16,3],[17,1,17,3],[18,1,18,3],[24,1,24,3],[19,1,19,3],[21,1,21,3],[22,0,22,4],[23,1,23,3],[28,1,28,3],[29,1,29,3],[30,0,30,4]]}
["Name of licenceholder:",null,{"$f":"'Cover Sheet'!C14","v":0}]
["Type of business carried out:",null,"Life Business"]
["Period from:",null,{"$f":"'Cover Sheet'!C21","v":"00:00:00"},"to",{"$f":"'Cover Sheet'!C22","v":"00:00:00"}]
["Document type:",null,"MFSA National Specific Templates"]
["Sheet Code:",null,"QNST02"]
[]
["Technical Account - Life Business"]
[]
[null,null,null,null,"Amount"]
[null,"Currency",null,null,"EUR"]
[1.1000000000000001,"Contracts measured under the Premium Allocation Approach",null,null,0]
[1.1100000000000001,"Contracts not measured under the Premium Allocation Approach",null,null,0]
[1,"Insurance revenue",null,null,{"$f":"SUM(E11:E12)","v":0},"calc."]
[]
[2.1,"Incurred claims and insurance services expenses",null,null,0]
[2.11,"Amortisation of insurance acquisition cash flows",null,null,0]
[2.12,"Losses and reversals of losses on onerous contracts",null,null,0]
[2.13,"Adjustments to liabilities for incurred claims",null,null,0]
[2.14,"(Impairment losses) and reversals of Insurance Acquisition Cash flows assets",null,null,0]
[2,"Insurance service expenses",null,null,{"$f":"SUM(E15:E19)","v":0},"calc."]
[]
[3,"Insurance service result before reinsurance contracts held",null,null,{"$f":"E13-E20","v":0},"calc."]
[]
[4.0999999999999996,"Allocation of reinsurance premiums paid",null,null,0]
[4.1100000000000003,"Amounts recoverable from reinsurers",null,null,0]
[4.12,"        Recoveries of incurred claims and other insurance service expenses",null,null,0]
[4.13,"        Recoveries and reversals of recoveries of losses on onerous underlying contracts",null,null,0]
[4.1399999999999997,"        Adjustments to assets for incurred claims",null,null,0]
[4.1500000000000004,"Effect of changes in non-performance risk of reinsurers",null,null,0]
[4,"Net expenses from reinsurance contracts",null,null,{"$f":"SUM(E24:E29)","v":0},"calc."]
[]
[5,"Insurance Service Result - Life Business",null,null,{"$f":"E22-E30","v":0},"calc."]
[]
[null,"Notes"]
["i","Please key in a value for each cell in the table where there is a validation. Where the cell contains no value, a value of zero is to be keyed in."]

{"sheet":"QNST03","index":3,"n_rows":43,"n_cols":6,"rows_kept":43,"cut":false,"hidden":false,"merged":[[14,1,14,3],[0,2,0,4],[1,2,1,4],[3,2,3,4],[4,2,4,4],[6,0,6,4],[9,1,9,3],[10,1,10,3],[11,1,11,3],[12,1,12,3],[13,1,13,3],[36,1,36,3],[37,1,37,3],[39,1,39,3],[42,1,42,4],[15,1,15,3],[16,1,16,3],[18,1,18,3],[38,1,38,3],[19,1,19,3],[17,1,17,3],[20,1,20,3],[21,1,21,3],[22,1,22,3],[24,1,24,3],[23,1,23,3],[25,1,25,3],[26,1,26,3],[27,1,27,3],[28,1,28,3],[29,1,29,3],[35,1,35,3],[30,1,30,3],[31,1,31,3],[32,1,32,3],[33,1,33,3],[34,1,34,3]]}
["Name of licenceholder:",null,{"$f":"'Cover Sheet'!C14","v":0}]
["Type of business carried out:",null,{"$f":"'Cover Sheet'!C18","v":0}]
["Period from:",null,{"$f":"'Cover Sheet'!C21","v":"00:00:00"},"to",{"$f":"'Cover Sheet'!C22","v":"00:00:00"}]
["Document type:",null,"MFSA National Specific Templates"]
["Sheet Code:",null,"QNST03"]
[]
["Non-Technical Account"]
[]
[null,null,null,null,"Amount"]
[null,"Currency",null,null,"EUR"]
[1.1000000000000001,"Insurance Service Result - General Business",null,null,{"$f":"QNST01!E32","v":0}]
[1.1100000000000001,"Insurance Service Result - Life Business",null,null,{"$f":"QNST02!E32","v":0}]
[]
[1,"Insurance Service Result - Total",null,null,{"$f":"SUM(E11:E12)","v":0},"calc."]
[]
[2.1,"Interest revenue calculated using the effective interest method",null,null,0]
[2.11,"Other investment revenue",null,null,0]
[2.12,"Net impairment gain/(loss) on financial assets",null,null,0]
[2,"Investment return",null,null,{"$f":"SUM(E16:E18)","v":0},"calc."]
[]
[3.1,"Net finance expenses from insurance contracts",null,null,0]
[3.11,"Net finance income from reinsurance contracts",null,null,0]
[3.12,"Movement in investment contract liabilities",null,null,0]
[3.13,"Movement in third party interests in consolidated funds",null,null,0]
[3,"Other financial expenses",null,null,{"$f":"SUM(E21:E24)","v":0},"calc."]
[]
[4,"Net financial result",null,null,{"$f":"E19-E25","v":0},"calc."]
[]
[5.0999999999999996,"Revenue from investment management services",null,null,0]
[5.1100000000000003,"Other income",null,null,0]
[5.12,"Other operating expenses",null,null,0]
[5.13,"Other finance costs",null,null,0]
[5.14,"Share of profit for equity-accounted investees, net of tax",null,null,0]
[5,"Other income/expenses",null,null,{"$f":"SUM(E29:E33)","v":0},"calc."]
[]
[6,"Profit before tax",null,null,{"$f":"E14+E27+E34","v":0},"calc."]
[]
[7,"Income tax expense",null,null,0]
[]
[8,"Profit after tax",null,null,{"$f":"E36+E38","v":0},"calc."]
{"$rows_left_out":4}
{"sheet":"QNST04","index":4,"n_rows":140,"n_cols":5,"rows_kept":140,"cut":false,"hidden":false,"merged":[[9,1,9,2],[10,1,10,2],[12,1,12,2],[13,1,13,2],[14,1,14,2],[15,1,15,2],[0,2,0,4],[1,2,1,4],[3,2,3,4],[4,2,4,4],[7,1,7,2],[8,1,8,2],[11,1,11,2],[22,1,22,2],[23,1,23,2],[24,1,24,2],[25,1,25,2],[26,1,26,2],[27,1,27,2],[16,1,16,2],[17,1,17,2],[18,1,18,2],[19,1,19,2],[20,1,20,2],[21,1,21,2],[28,1,28,2],[29,1,29,2],[30,1,30,2],[31,1,31,2],[32,1,32,2],[33,1,33,2],[43,1,43,2],[44,1,44,2],[47,1,47,2],[34,1,34,2],[41,1,41,2],[40,1,40,2],[42,1,42,2],[35,1,35,2],[36,1,36,2],[37,1,37,2],[38,1,38,2],[39,1,39,2],[45,1,45,2],[46,1,46,2],[123,1,123,2],[114,1,114,2],[115,1,115,2],[116,1,116,2],[117,1,117,2],[139,1,139,4],[131,1,131,2],[132,1,132,2],[133,1,133,2],[134,1,134,2],[135,1,135,2],[138,1,138,4],[124,0,124,4],[125,1,125,2],[127,1,127,2],[128,1,128,2],[129,1,129,2],[130,1,130,2],[118,1,118,2],[119,1,119,2],[120,1,120,2],[121,1,121,2],[122,1,122,2],[51,1,51,2],[52,1,52,2],[74,1,74,2],[77,1,77,2],[81,1,81,2],[92,1,92,2],[93,1,93,2],[94,1,94,2],[95,1,95,2],[58,1,58,2],[59,1,59,2],[60,1,60,2],[61,1,61,2],[62,1,62,2],[56,1,56,2],[57,1,57,2],[80,1,80,2],[87,1,87,2],[88,1,88,2],[70,1,70,2],[73,1,73,2],[90,1,90,2],[91,1,91,2],[89,1,89,2],[63,1,63,2],[65,1,65,2],[66,1,66,2],[67,1,67,2],[110,1,110,2],[111,1,111,2],[112,1,112,2],[113,1,113,2],[108,1,108,2],[105,1,105,2],[106,1,106,2],[107,1,107,2],[98,1,98,2],[99,1,99,2],[100,1,100,2],[101,1,101,2],[102,1,102,2],[96,1,96,2],[97,1,97,2],[103,1,103,2],[104,1,104,2]]}
["Name of licenceholder:",null,{"$f":"'Cover Sheet'!C14","v":0}]
["Type of business carried out:",null,{"$f":"'Cover Sheet'!C18","v":0}]
["Period from:",null,{"$f":"'Cover Sheet'!C21","v":"00:00:00"},"to",{"$f":"'Cover Sheet'!C22","v":"00:00:00"}]
["Document type:",null,"MFSA National Specific Templates"]
["Sheet Code:",null,"QNST04"]
[]
[null,null,null,"Solvency II Value","Management Accounts - Balance Sheet Value"]
[null,"Currency",null,"EUR","EUR"]
[null,"Assets"]
[1,"Goodwill"]
[2,"Intangible assets"]
[3,"   Right-of-use assets"]
[4,"Deferred tax assets"]
[5,"Employee benefit surplus"]
[6,"Property, plant & equipment held for own use"]
[7,"Investments (other than assets held for index-linked and unit-linked contracts) ",null,{"$f":"D17+D18+D19+D22+D27+D28+D29+D30","v":0},{"$f":"E17+E18+E19+E22+E27+E28+E29+E30","v":0}]
[8,"Property (other than for own use)"]
[9,"Holdings in related undertakings, including participations"]
[10,"Equities",null,{"$f":"SUM(D20:D21)","v":0},{"$f":"SUM(E20:E21)","v":0}]
[11,"Equities - listed"]
[12,"Equities - unlisted"]
[13,"Bonds",null,{"$f":"SUM(D23:D26)","v":0},{"$f":"SUM(E23:E26)","v":0}]
[14,"Government Bonds"]
[15,"Corporate Bonds"]
[16,"Structured notes"]
[17,"Collateralised securities"]
[18,"Collective Investments Undertakings"]
[19,"Derivatives"]
[20,"Deposits other than cash equivalents"]
[21,"Other investments"]
[22,"Assets held for index-linked and unit-linked contracts"]
[23,"Loans and mortgages",null,{"$f":"SUM(D33:D35)","v":0},{"$f":"SUM(E33:E35)","v":0}]
[24,"Loans on policies"]
[25,"Loans and mortgages to individuals"]
[26,"Other loans and mortgages"]
[27,"Reinsurance recoverables ",null,{"$f":"D37+D40","v":0},{"$f":"E37+E40","v":0}]
[28,"Non-life and health similar to non-life",null,{"$f":"SUM(D38:D39)","v":0},{"$f":"SUM(E38:E39)","v":0}]
[29,"Non-life excluding health"]
[30,"Health similar to non-life"]
[31,"Life and health similar to life, excluding health and index-linked and unit-linked",null,{"$f":"SUM(D41:D42)","v":0},{"$f":"SUM(E41:E42)","v":0}]
{"$rows_left_out":101}
{"sheet":"QNST05_A","index":5,"n_rows":54,"n_cols":9,"rows_kept":54,"cut":false,"hidden":false,"merged":[[9,1,11,1],[9,2,11,2],[9,3,11,3],[9,4,11,4],[9,5,11,5],[9,6,11,6],[9,7,11,7],[9,8,11,8],[1,2,1,4],[2,2,2,4],[4,2,4,4],[5,2,5,4]]}
[]
[null,"Name of licenceholder:",{"$f":"'Cover Sheet'!C14","v":0}]
[null,"Type of business carried out:",{"$f":"'Cover Sheet'!C18","v":0}]
[null,"Period from:",{"$f":"'Cover Sheet'!C21","v":"00:00:00"},"to",{"$f":"'Cover Sheet'!C22","v":"00:00:00"}]
[null,"Document type:","MFSA National Specific Templates"]
[null,"Sheet Code:","QNST05_A"]
[]
[null,"Activity by Country - General Business - This sheet is to be completed by all insurance undertakings carrying out insurance/reinsurance business activities inside and outside Malta."]
[]
[null,"Jurisdiction","Line of business","FOS / FOE / Non-EEA / Not applicable *","Gross Premiums Written **","Gross Claims Incurred ***","Gross Commissions ****","Number of contracts *****"]
[]
[]
[]
[]
[]
[]
[]
[]
[]
[]
[]
[]
[]
[]
[]
[null,null,null,null,null,null,null,null," "]
[]
[]
[]
[]
[]
[]
[]
[]
[]
[]
[]
[]
[]
[]
{"$rows_left_out":15}
{"sheet":"QNST05_B","index":6,"n_rows":51,"n_cols":8,"rows_kept":51,"cut":false,"hidden":false,"merged":[[9,5,11,5],[9,6,11,6],[9,7,11,7],[47,1,47,6],[1,2,1,4],[2,2,2,4],[4,2,4,4],[5,2,5,4],[9,1,11,1],[9,2,11,2],[9,3,11,3],[9,4,11,4]]}
[]
[null,"Name of licenceholder:",{"$f":"'Cover Sheet'!C14","v":0}]
[null,"Type of business carried out:",{"$f":"'Cover Sheet'!C18","v":0}]
[null,"Period from:",{"$f":"'Cover Sheet'!C21","v":"00:00:00"},"to",{"$f":"'Cover Sheet'!C22","v":"00:00:00"}]
[null,"Document type:","MFSA National Specific Templates"]
[null,"Sheet Code:","QNST05_B"]
[]
[null,"Activity by Country - Life Business - This sheet is to be completed by all insurance undertakings carrying out insurance/reinsurance business activities inside and outside Malta."]
[]
[null,"Jurisdiction","Line of business","FOS / FOE / Non-EEA / Not applicable *","Gross Premiums Written **","Number of contracts ","Gross Commissions ***"]
[]
[]
[]
[]
[]
[]
[]
[]
[]
[]
[]
[]
[]
[]
[null,null,null,null,null,null,null," "]
[]
[]
[]
[]
[]
[]
[]
[]
[]
[]
[]
[]
[]
[]
[]
{"$rows_left_out":12}
{"sheet":"CBM","index":7,"n_rows":889,"n_cols":11,"rows_kept":889,"cut":false,"hidden":false,"merged":[[264,1,264,2],[38,1,38,2],[8,1,8,4],[8,9,8,10]],"read":"row_number_cap"}
["A"]
[1,null,null,null,null,null,null,"CONFIDENTIAL"]
[0]
[2]
[1,"Period from:",{"$f":"IF('Cover Sheet'!C21=\"\",\"\",'Cover Sheet'!C21)","v":""}]
[1,"Period to:",{"$f":"IF('Cover Sheet'!C22=\"\",\"\",'Cover Sheet'!C22)","v":""}]
[1]
[1]
[1,"PART A:  SELECTED INCOME AND EXPENSE ITEMS (cumulative for the undertaking's financial year)",null,null,null,null,"Amount"]
[1,null,"Income"]
[1,1.1000000000000001,"interest receivable"]
[1,1.2,"dividends receivable"]
[1,1.3,"rental income"]
[1,1.4,"exchange differences"]
[1,1.5,"income from financial investments at fair value through PL"]
[1,1.6,"gains/losses from revaluation of financial assets (net fair value gains/losses)"]
[1,1.7,"gains/losses from revaluation of investment property (net fair value gains/losses)"]
[1,1.8,"other technical income"]
[1,1.9,"interest expense"]
[1,1.1000000000000001,"share of losses from related parties"]
[1,1.1100000000000001,"investment expenses"]
[1,null,"Expenses"]
[1,2.1,"wages and salaries (including directors' fees and remuneration)"]
[1,2.2000000000000002,"social security contributions"]
[1,2.2999999999999998,"depreciation"]
[1,2.4,"amortisation"]
[1]
[1,3,"Bonuses and rebates"]
[1,4,"Movement in value of in-force business"]
[1]
[1]
[1,"PART B:  ADDITIONAL INFORMATION"]
[1,5,"Number of employees",null,null,null,{"$f":"SUM(G34:G35)","v":0}]
[1,5.0999999999999996,"   full time"]
[1,5.2,"   part time"]
[1]
[1]
[1,"PART C:  SELECTED TRANSACTIONS WITH NON-RESIDENTS OF MALTA"]
[1,"Insurance transactions (for the quarter)",null,"* Press +/- to add\n/delete countries","Country *","Country Code","Premiums","Claims"]
[1,6,"Primary insurance (with non-residents of Malta)",null,null,{"$f":"IF(E40=\"\",\"\",VLOOKUP(E40,$C$813:$E$853,2,FALSE))","v":""},{"$f":"SUM(G41:G84)","v":0},{"$f":"SUM(H41:H84)","v":0}]
{"$rows_left_out":850}
{"sheet":"List","index":8,"n_rows":252,"n_cols":15,"rows_kept":252,"cut":false,"hidden":true,"merged":[]}
[]
[]
[null,"AFGHANISTAN",null,null,"FOS",null,"Medical expense insurance - Direct Business",null,null,null,null,null,null,null,"Health insurance"]
[null,"ÅLAND ISLANDS",null,null,"FOE",null,"Medical expense insurance - Proportional reinsurance accepted ",null,null,null,null,null,null,null,"Insurance with profit participation"]
[null,"ALBANIA",null,null,"Non-EEA",null,"Income protection insurance - Direct Business",null,null,null,null,null,null,null,"Index-linked and unit-linked insurance"]
[null,"ALGERIA",null,null,"Not applicable",null,"Income protection insurance - Proportional reinsurance accepted ",null,null,null,null,null,null,null,"Other life insurance"]
[null,"AMERICAN SAMOA",null,null,null,null,"Workers' compensation insurance - Direct Business",null,null,null,null,null,null,null,"Annuities stemming from non-life insurance contracts and relating to health insurance obligations"]
[null,"ANDORRA",null,null,null,null,"Workers' compensation insurance - Proportional reinsurance accepted ",null,null,null,null,null,null,null,"Annuities stemming from non-life insurance contracts and relating to insurance obligations other than health insurance obligations"]
[null,"ANGOLA",null,null,null,null,"Motor vehicle liability insurance - Direct Business",null,null,null,null,null,null,null,"Health reinsurance"]
[null,"ANGUILLA",null,null,null,null,"Motor vehicle liability insurance - Proportional reinsurance accepted ",null,null,null,null,null,null,null,"Life reinsurance"]
[null,"ANTARCTICA",null,null,null,null,"Other motor insurance - Direct Business"]
[null,"ANTIGUA AND BARBUDA",null,null,null,null,"Other motor insurance - Proportional reinsurance accepted "]
[null,"ARGENTINA",null,null,null,null,"Marine, aviation and transport insurance - Direct Business"]
[null,"ARMENIA",null,null,null,null,"Marine, aviation and transport insurance - Proportional reinsurance accepted "]
[null,"ARUBA",null,null,null,null,"Fire and other damage to property insurance - Direct Business"]
[null,"AUSTRALIA",null,null,null,null,"Fire and other damage to property insurance - Proportional reinsurance accepted "]
[null,"AUSTRIA",null,null,null,null,"General liability insurance - Direct Business"]
[null,"AZERBAIJAN",null,null,null,null,"General liability insurance - Proportional reinsurance accepted "]
[null,"BAHAMAS",null,null,null,null,"Credit and suretyship insurance - Direct Business"]
[null,"BAHRAIN",null,null,null,null,"Credit and suretyship insurance - Proportional reinsurance accepted "]
[null,"BANGLADESH",null,null,null,null,"Legal expenses insurance - Direct Business"]
[null,"BARBADOS",null,null,null,null,"Legal expenses insurance - Proportional reinsurance accepted "]
[null,"BELARUS",null,null,null,null,"Assistance - Direct Business"]
[null,"BELGIUM",null,null,null,null,"Assistance - Proportional reinsurance accepted "]
[null,"BELIZE",null,null,null,null,"Miscellaneous financial loss - Direct Business"]
[null,"BENIN",null,null,null,null,"Miscellaneous financial loss - Proportional reinsurance accepted "]
[null,"BERMUDA",null,null,null,null,"Health - Non-proportional reinsurance accepted "]
[null,"BHUTAN",null,null,null,null,"Casualty - Non-proportional reinsurance accepted "]
[null,"BOLIVIA, PLURINATIONAL STATE OF",null,null,null,null,"Marine, aviation, transport - Non-proportional reinsurance accepted "]
[null,"BONAIRE, SINT EUSTATIUS AND SABA",null,null,null,null,"Property - Non-proportional reinsurance accepted "]
[null,"BOSNIA AND HERZEGOVINA"]
[null,"BOTSWANA"]
[null,"BOUVET ISLAND"]
[null,"BRAZIL"]
[null,"BRITISH INDIAN OCEAN TERRITORY"]
[null,"BRUNEI DARUSSALAM"]
[null,"BULGARIA"]
[null,"BURKINA FASO"]
[null,"BURUNDI"]
[null,"CAMBODIA"]
{"$rows_left_out":212}